Target
Caspase-5
Ligand
BDBM160770
Substrate
Meas. Tech.
Fluorometric Enzymatic Assay
Temperature
310.15±n/a K
IC50
>3330±n/a nM
Comments
extracted
Citation
 Ahlfors, JMekouar, K Selective caspase inhibitors and uses thereof US Patent  US9045524 Publication Date 6/2/2015 
Target
Name:
Caspase-5
Synonyms:
CASP-5 CASP5_HUMAN Caspase-5 subunit p10 ICE(rel)-III ICH3 Protease TY | TY protease
Type:
Enzyme
Mol. Mass.:
49760.80
Organism:
Homo sapiens (Human)
Description:
P51878
Residue:
434
  
Inhibitor
Name:
BDBM160770
Synonyms:
US10167313, Compound 37 | US9045524, 37
Type:
Small organic molecule
Emp. Form.:
C15H21NO4S
Mol. Mass.:
311.397
SMILES:
CC(C)(C)OC(=O)C[C@H](N)\C=C\S(=O)(=O)c1ccccc1
: