Target
Caspase-5
Ligand
BDBM160819
Substrate
Meas. Tech.
Fluorometric Enzymatic Assay
Temperature
310.15±n/a K
IC50
>3330±n/a nM
Comments
extracted
Citation
 Ahlfors, JMekouar, K Selective caspase inhibitors and uses thereof US Patent  US9045524 Publication Date 6/2/2015 
Target
Name:
Caspase-5
Synonyms:
CASP-5 CASP5_HUMAN Caspase-5 subunit p10 ICE(rel)-III ICH3 Protease TY | TY protease
Type:
Enzyme
Mol. Mass.:
49760.80
Organism:
Homo sapiens (Human)
Description:
P51878
Residue:
434
  
Inhibitor
Name:
BDBM160819
Synonyms:
US10167313, Compound 88 | US9045524, 88
Type:
Small organic molecule
Emp. Form.:
C34H41N5O11S
Mol. Mass.:
727.781
SMILES:
CC(C)[C@H](NC(=O)[C@H](Cc1c[nH]c2ccccc12)NC(=O)[C@H](CC(O)=O)NC(=O)OCc1ccccc1)C(=O)N[C@@H](CC(O)=O)\C=C\S(C)(=O)=O
: