Target
Caspase-7
Ligand
BDBM160781
Substrate
Meas. Tech.
Fluorometric Enzymatic Assay
Temperature
310.15±n/a K
IC50
400±n/a nM
Comments
extracted
Citation
 Ahlfors, JMekouar, K Selective caspase inhibitors and uses thereof US Patent  US9045524 Publication Date 6/2/2015 
Target
Name:
Caspase-7
Synonyms:
Apoptotic protease Mch-3 CASP7 CMH-1 MCH3 | caspase 7, apoptosis-related cysteine peptidase
Type:
Enzyme
Mol. Mass.:
34273.91
Organism:
Homo sapiens (Human)
Description:
P55210
Residue:
303
  
Inhibitor
Name:
BDBM160781
Synonyms:
US10167313, Compound 48 | US9045524, 48
Type:
Small organic molecule
Emp. Form.:
C35H40ClN5O11S
Mol. Mass.:
774.237
SMILES:
CC(C)[C@H](NC(=O)[C@H](Cc1ccc2ccccc2n1)NC(=O)[C@H](CC(O)=O)NC(=O)OCc1ccccc1)C(=O)N[C@@H](CC(O)=O)\C=C(/Cl)S(C)(=O)=O
: