Target
Caspase-9
Ligand
BDBM160803
Substrate
Meas. Tech.
Fluorometric Enzymatic Assay
Temperature
310.15±n/a K
IC50
>3330±n/a nM
Comments
extracted
Citation
 Ahlfors, JMekouar, K Selective caspase inhibitors and uses thereof US Patent  US9045524 Publication Date 6/2/2015 
Target
Name:
Caspase-9
Synonyms:
Apoptotic protease-activating factor 1/Caspase-3/Caspase-9/Cytochrome c CASP-9 CASP9_HUMAN ICE-like apoptotic protease 6 caspase-9 isoform alpha preproprotein
Type:
Enzyme
Mol. Mass.:
46277.29
Organism:
Homo sapiens (Human)
Description:
Residue:
416
  
Inhibitor
Name:
BDBM160803
Synonyms:
US9045524, 70
Type:
Small organic molecule
Emp. Form.:
C40H43N5O11S
Mol. Mass.:
801.861
SMILES:
CC(C)[C@H](NC(=O)C(Cc1ccc2ccccc2n1)NC(=O)[C@H](CC(O)=O)NC(=O)OCc1ccccc1)C(=O)N[C@@H](CC(O)=O)\C=C\S(=O)(=O)c1ccccc1
: