Target
Caspase-3
Ligand
BDBM160784
Substrate
Meas. Tech.
Inhibition Assay
IC50
1000±n/a nM
Citation
 Ahlfors, JMekouar, K Selective caspase inhibitors and uses thereof US Patent  US9045524 Publication Date 6/2/2015 
Target
Name:
Caspase-3
Synonyms:
Apopain CASP3 CPP-32 Caspase 3 Caspase-3 subunit p17 SCA-1 Yama protein | caspase-3 preproprotein
Type:
Hydrolase; heterotetramer of two heterodimers
Mol. Mass.:
31607.55
Organism:
Homo sapiens (Human)
Description:
Residue:
277
  
Inhibitor
Name:
BDBM160784
Synonyms:
US10167313, Compound 51 | US9045524, 51
Type:
Small organic molecule
Emp. Form.:
C36H46N4O11S
Mol. Mass.:
742.836
SMILES:
COC(=O)C[C@H](NC(=O)[C@@H](NC(=O)[C@@H](NC(=O)[C@H](CC(=O)OC)NC(=O)OCc1ccccc1)C1Cc2ccccc2C1)C(C)C)\C=C\S(C)(=O)=O
: