Target
ATP-sensitive inward rectifier potassium channel 1
Ligand
BDBM161032
Substrate
Meas. Tech.
Electrophysiology Assay
pH
7.4±n/a
Temperature
310.15±n/a K
IC50
420±n/a nM
Comments
extracted
Citation
 Walsh, SPPasternak, AShi, ZCato, B Inhibitors of the Renal Outer Medullary Potassium channel US Patent  US9108947 Publication Date 8/18/2015 
Target
Name:
ATP-sensitive inward rectifier potassium channel 1
Synonyms:
ATP-regulated potassium channel ROM-K ATP-sensitive inward rectifier potassium channel 1 KCNJ1 Potassium channel (ATP modulatory) ROMK1 The Renal Outer Medullary Potassium (ROMK)
Type:
Enzyme Catalytic Domain
Mol. Mass.:
44809.08
Organism:
Homo sapiens (Human)
Description:
gi_223460826
Residue:
391
  
Inhibitor
Name:
BDBM161032
Synonyms:
US9108947, 2
Type:
Small organic molecule
Emp. Form.:
C30H36N2O6
Mol. Mass.:
520.6166
SMILES:
Cc1c2COC(=O)c2ccc1[C@@H](O)CNC1(CCC1)C1CCN(C[C@H](O)c2ccc3C(=O)OCc3c2C)C1
: