Target
ATP-sensitive inward rectifier potassium channel 1
Ligand
BDBM161043
Substrate
Meas. Tech.
Electrophysiology Assay
pH
7.4±n/a
Temperature
310.15±n/a K
IC50
65±n/a nM
Comments
extracted
Citation
 Walsh, SPPasternak, AShi, ZCato, B Inhibitors of the Renal Outer Medullary Potassium channel US Patent  US9108947 Publication Date 8/18/2015 
Target
Name:
ATP-sensitive inward rectifier potassium channel 1
Synonyms:
ATP-regulated potassium channel ROM-K ATP-sensitive inward rectifier potassium channel 1 KCNJ1 Potassium channel (ATP modulatory) ROMK1 The Renal Outer Medullary Potassium (ROMK)
Type:
Enzyme Catalytic Domain
Mol. Mass.:
44809.08
Organism:
Homo sapiens (Human)
Description:
gi_223460826
Residue:
391
  
Inhibitor
Name:
BDBM161043
Synonyms:
US9108947, 18
Type:
Small organic molecule
Emp. Form.:
C22H24N4O3
Mol. Mass.:
392.451
SMILES:
Cc1c2COC(=O)c2ccc1[C@@H](O)CN1CCCC1CNc1ccc(cn1)[N+]#[C-]
: