Target
Peroxisome proliferator-activated receptor gamma
Ligand
BDBM161156
Substrate
Meas. Tech.
Lanthascreen Competitive Binding Assay
IC50
0.2±n/a nM
Citation
 Kamenecka, TMGriffin, PRKoenig, MAsteian, ABlayo, AHe, YShin, Y N-benzylindole modulators of PPARG US Patent  US9051265 Publication Date 6/9/2015 
Target
Name:
Peroxisome proliferator-activated receptor gamma
Synonyms:
NR1C3 PPAR-gamma PPARG_HUMAN Peroxisome proliferator-activated receptor gamma (PPAR gamma) Peroxisome proliferator-activated receptor gamma (PPARĪ³) peroxisome proliferator-activated receptor gamma isoform 2
Type:
Nuclear Receptor
Mol. Mass.:
57613.46
Organism:
Homo sapiens (Human)
Description:
P37231
Residue:
505
  
Inhibitor
Name:
BDBM161156
Synonyms:
US9051265, 64 | US9051265, 99
Type:
Small organic molecule
Emp. Form.:
C33H37ClN2O4
Mol. Mass.:
561.111
SMILES:
C[C@H](NC(=O)c1ccc2n(Cc3cc(O[C@@H](C)C(O)=O)ccc3Cl)c(C)c(C)c2c1)c1ccc(cc1)C(C)(C)C
: