Target
Sodium channel protein type 10 subunit alpha
Ligand
BDBM161229
Substrate
Meas. Tech.
Electrophysiology Assay
IC50
65±n/a nM
Citation
 Hadida-Ruah, SSAnderson, CArumugam, VAsgian, ILBear, BRTermin, APJohnson, JP Pyridone amides as modulators of sodium channels US Patent  US9051270 Publication Date 6/9/2015 
Target
Name:
Sodium channel protein type 10 subunit alpha
Synonyms:
SCNAA_RAT Sns Sodium channel protein type X alpha subunit | Voltage-gated sodium channel subunit alpha Nav1.8
Type:
Enzyme
Mol. Mass.:
219724.17
Organism:
Rattus norvegicus (Rat)
Description:
Q62968
Residue:
1956
  
Inhibitor
Name:
BDBM161229
Synonyms:
US10087143, Compound 14 US11673864, Compound 14 US9758483, Compound 14
Type:
Small organic molecule
Emp. Form.:
C18H11Cl2FN2O3
Mol. Mass.:
393.196
SMILES:
Fc1ccc(Oc2cc(Cl)ccc2C(=O)Nc2cc[nH]c(=O)c2)c(Cl)c1
: