Target
Sodium channel protein type 10 subunit alpha
Ligand
BDBM161329
Substrate
Meas. Tech.
Electrophysiology Assay
IC50
1±n/a nM
Citation
 Hadida-Ruah, SSAnderson, CArumugam, VAsgian, ILBear, BRTermin, APJohnson, JP Pyridone amides as modulators of sodium channels US Patent  US9051270 Publication Date 6/9/2015 
Target
Name:
Sodium channel protein type 10 subunit alpha
Synonyms:
SCNAA_RAT Sns Sodium channel protein type X alpha subunit | Voltage-gated sodium channel subunit alpha Nav1.8
Type:
Enzyme
Mol. Mass.:
219724.17
Organism:
Rattus norvegicus (Rat)
Description:
Q62968
Residue:
1956
  
Inhibitor
Name:
BDBM161329
Synonyms:
US10087143, Compound 114 US10787472, Compound 1a US9051270, 114 US9758483, Compound 114
Type:
Small organic molecule
Emp. Form.:
C19H13Cl2FN2O4
Mol. Mass.:
423.222
SMILES:
COc1cc(F)ccc1Oc1cc(Cl)c(Cl)cc1C(=O)Nc1cc[nH]c(=O)c1
: