Target
Fibroblast growth factor receptor 2
Ligand
BDBM161447
Substrate
Meas. Tech.
Inhibition Assay
pH
7.5±n/a
Temperature
298.15±n/a K
IC50
1.5±n/a nM
Comments
extracted
Citation
 Sagara, TIto, SOtsuki, SSootome, H 3,5-disubstituted alkynylbenzene compound and salt thereof US Patent  US9108973 Publication Date 8/18/2015 
Target
Name:
Fibroblast growth factor receptor 2
Synonyms:
BEK FGFR-2 FGFR2 Fibroblast growth factor receptor 2 (FGFR2) KGFR Keratinocyte growth factor receptor VEGF-receptor 2 and Fibroblast growth factor receptor 2
Type:
Enzyme
Mol. Mass.:
92015.45
Organism:
Homo sapiens (Human)
Description:
P21802
Residue:
821
  
Inhibitor
Name:
BDBM161447
Synonyms:
US10124003, Ex. Compound 60 US10894048, Ex Comp 60 | US9108973, 60
Type:
Small organic molecule
Emp. Form.:
C27H32N6O4
Mol. Mass.:
504.5808
SMILES:
COCCN(C)C\C=C\C(=O)N1CC(C1)n1cc(C#Cc2cc(OC)cc(OC)c2)c2c(N)ncnc12
: