Target
Fibroblast growth factor receptor 2
Ligand
BDBM161450
Substrate
Meas. Tech.
Inhibition Assay
pH
7.5±n/a
Temperature
298.15±n/a K
IC50
1±n/a nM
Comments
extracted
Citation
 Sagara, TIto, SOtsuki, SSootome, H 3,5-disubstituted alkynylbenzene compound and salt thereof US Patent  US9108973 Publication Date 8/18/2015 
Target
Name:
Fibroblast growth factor receptor 2
Synonyms:
BEK FGFR-2 FGFR2 Fibroblast growth factor receptor 2 (FGFR2) KGFR Keratinocyte growth factor receptor VEGF-receptor 2 and Fibroblast growth factor receptor 2
Type:
Enzyme
Mol. Mass.:
92015.45
Organism:
Homo sapiens (Human)
Description:
P21802
Residue:
821
  
Inhibitor
Name:
BDBM161450
Synonyms:
US10124003, Ex. Compound 63 US10894048, Ex Comp 62 | US9108973, 63
Type:
Small organic molecule
Emp. Form.:
C27H30N6O4
Mol. Mass.:
502.5649
SMILES:
COc1cc(OC)cc(c1)C#Cc1cn(C2CN(C2)C(=O)\C=C\CN2CC[C@@H](O)C2)c2ncnc(N)c12
: