Target
Fibroblast growth factor receptor 4
Ligand
BDBM161392
Substrate
Meas. Tech.
Inhibition Assay
IC50
0.5±n/a nM
Citation
 Sagara, TIto, SOtsuki, SSootome, H 3,5-disubstituted alkynylbenzene compound and salt thereof US Patent  US9108973 Publication Date 8/18/2015 
Target
Name:
Fibroblast growth factor receptor 4
Synonyms:
CD_antigen: CD334 FGFR4 FGFR4 Fibroblast growth factor receptor JK2 TKF
Type:
Protein
Mol. Mass.:
87957.45
Organism:
Homo sapiens (Human)
Description:
P22455
Residue:
802
  
Inhibitor
Name:
BDBM161392
Synonyms:
US10124003, Ex. Compound 5 US10894048, Ex Comp 5 | US9108973, 5
Type:
Small organic molecule
Emp. Form.:
C22H20N6O3
Mol. Mass.:
416.4326
SMILES:
COc1cc(OC)cc(c1)C#Cc1nn([C@H]2CCN(C2)C(=O)C#C)c2ncnc(N)c12
: