Target
D-amino-acid oxidase
Ligand
BDBM287762
Substrate
Meas. Tech.
In Vitro DAAO Enzyme Assay
pH
7.4±n/a
IC50
120±n/a nM
Comments
extracted
Citation
 Cockcroft, XFFarnaby, WKinsella, NMerchant, KMiller, D Pyrimidinone compounds and their use US Patent  US10085986 Publication Date 10/2/2018 
Target
Name:
D-amino-acid oxidase
Synonyms:
D-amino-acid oxidase (DAAO) DAMOX OXDA_HUMAN
Type:
Homodimer
Mol. Mass.:
39476.06
Organism:
Homo sapiens (Human)
Description:
P14920
Residue:
347
  
Inhibitor
Name:
BDBM287762
Synonyms:
US10085986, Example 5
Type:
Small organic molecule
Emp. Form.:
C15H12N2O2S
Mol. Mass.:
284.333
SMILES:
Oc1cnc(SCc2ccc3ccccc3c2)[nH]c1=O
: