Target
D-amino-acid oxidase
Ligand
BDBM287772
Substrate
Meas. Tech.
In Vitro DAAO Enzyme Assay
pH
7.4±n/a
IC50
1600±n/a nM
Comments
extracted
Citation
 Cockcroft, XFFarnaby, WKinsella, NMerchant, KMiller, D Pyrimidinone compounds and their use US Patent  US10085986 Publication Date 10/2/2018 
Target
Name:
D-amino-acid oxidase
Synonyms:
D-amino-acid oxidase (DAAO) DAMOX OXDA_HUMAN
Type:
Homodimer
Mol. Mass.:
39476.06
Organism:
Homo sapiens (Human)
Description:
P14920
Residue:
347
  
Inhibitor
Name:
BDBM287772
Synonyms:
US10085986, Example 21
Type:
Small organic molecule
Emp. Form.:
C10H12N4O2S
Mol. Mass.:
252.293
SMILES:
Cc1cc(CSc2ncc(O)c(=O)[nH]2)n(C)n1
: