Target
D-amino-acid oxidase
Ligand
BDBM287777
Substrate
Meas. Tech.
In Vitro DAAO Enzyme Assay
pH
7.4±n/a
IC50
2700±n/a nM
Comments
extracted
Citation
 Cockcroft, XFFarnaby, WKinsella, NMerchant, KMiller, D Pyrimidinone compounds and their use US Patent  US10085986 Publication Date 10/2/2018 
Target
Name:
D-amino-acid oxidase
Synonyms:
D-amino-acid oxidase (DAAO) DAMOX OXDA_HUMAN
Type:
Homodimer
Mol. Mass.:
39476.06
Organism:
Homo sapiens (Human)
Description:
P14920
Residue:
347
  
Inhibitor
Name:
BDBM287777
Synonyms:
US10085986, Example 34
Type:
Small organic molecule
Emp. Form.:
C12H9F3N2O2S
Mol. Mass.:
302.272
SMILES:
Oc1c(nc(SCc2ccccc2)[nH]c1=O)C(F)(F)F
: