Target
E3 ubiquitin-protein ligase Mdm2
Ligand
BDBM162052
Substrate
Meas. Tech.
Time Resolved Fluorescence Energy Transfer (TR-FRET) Assay
IC50
2.5±n/a nM
Citation
 Berghausen, JBuschmann, NFuret, PGessier, FHergovich Lisztwan, JHolzer, PJacoby, EKallen, JMasuya, KPissot Soldermann, CRen, HStutz, S Substituted isoquinolinones and quinazolinones US Patent  US9051279 Publication Date 6/9/2015 
Target
Name:
E3 ubiquitin-protein ligase Mdm2
Synonyms:
Double minute 2 protein E3 ubiquitin-protein ligase Mdm2 (p53-binding protein Mdm2) Human Double Minute 2 (HDM2) MDM2-MDMX p53-Binding Protein MDM2 | p53-binding protein
Type:
Oncoprotein
Mol. Mass.:
55196.54
Organism:
Homo sapiens (Human)
Description:
Q00987
Residue:
491
  
Inhibitor
Name:
BDBM162052
Synonyms:
US9051279, 75
Type:
Small organic molecule
Emp. Form.:
C35H44ClN3O3
Mol. Mass.:
590.195
SMILES:
COc1cc2CC(=O)N([C@@H](c3ccc(Cl)cc3)c2cc1OC(C)C)c1ccc(cc1)N(C)C[C@H]1CC[C@@H](CC1)N(C)C
: