Target
Enoyl-[acyl-carrier-protein] reductase [NADPH] FabI
Ligand
BDBM133669
Substrate
Meas. Tech.
Fluorescence Based Assay
pH
6.5±n/a
Temperature
298.15±n/a K
IC50
4100±n/a nM
Comments
extracted
Citation
 Gerusz, VEscaich, SOxoby, MDenis, A Heterocyclic acrylamides and their use as pharmaceuticals US Patent  US9051321 Publication Date 6/9/2015 
Target
Name:
Enoyl-[acyl-carrier-protein] reductase [NADPH] FabI
Synonyms:
Enoyl-[acyl-carrier-protein] reductase [NADPH] FabI FABI_STAA8 fabI
Type:
Enzyme
Mol. Mass.:
28019.03
Organism:
Staphylococcus aureus
Description:
Q2FZQ3
Residue:
256
  
Inhibitor
Name:
BDBM133669
Synonyms:
US8846711, 13 | US9051321, 13
Type:
Small organic molecule
Emp. Form.:
C19H21N5O3
Mol. Mass.:
367.4017
SMILES:
Cc1nc(no1)C1CCCCN1C(=O)\C=C\c1cnc2NC(=O)CCc2c1
: