Target
Histone deacetylase 4
Ligand
BDBM162722
Substrate
Meas. Tech.
Inhibition Assay
pH
8±n/a
Temperature
298.15±n/a K
IC50
660±n/a nM
Comments
extracted
Citation
 Hebach, CJoly, EKallen, JTernois, JGTintelnot-Blomley, M Trifluoromethyl-oxadiazole derivatives and their use in the treatment of disease US Patent  US9056843 Publication Date 6/16/2015 
Target
Name:
Histone deacetylase 4
Synonyms:
Cereblon/Histone deacetylase 4 HDAC4 Histone acetylase 4(HDAC4) KIAA0288
Type:
Enzyme
Mol. Mass.:
119049.39
Organism:
Homo sapiens (Human)
Description:
P56524
Residue:
1084
  
Inhibitor
Name:
BDBM162722
Synonyms:
US9056843, 13 | US9056843, 17
Type:
Small organic molecule
Emp. Form.:
C12H10F3N3O3
Mol. Mass.:
301.2213
SMILES:
OCCNC(=O)c1ccc(cc1)-c1noc(n1)C(F)(F)F
: