Target
Genome polyprotein
Ligand
BDBM163033
Substrate
Meas. Tech.
Radiolabeled Nucleotide Incorporation Assay
pH
7.3±n/a
Temperature
298.15±n/a K
Ki
4700±n/a nM
Comments
extracted
Citation
 Girijavallabhan, VNjoroge, FGBogen, SVerma, VBennett, FKerekes, AArasappan, APissarnitski, DDang, QDavies, IOlsen, DBStamford, AVacca, JP 2′-substituted nucleoside derivatives and methods of use thereof for the treatment of viral diseases US Patent  US9061041 Publication Date 6/23/2015 
Target
Name:
Genome polyprotein
Synonyms:
Dipeptidyl peptidase 4 (DPP4) NS3 NS5B NS3-4A Protease NS3/4A protease POLG_HCV77 | RNA polymerase (NS5B)
Type:
Protease Domain
Mol. Mass.:
327221.49
Organism:
Hepatitis C virus (HCV genotype 1a, isolate H)
Description:
P27958
Residue:
3011
  
Inhibitor
Name:
BDBM163033
Synonyms:
US9061041, 24
Type:
Small organic molecule
Emp. Form.:
C22H31N4O9P
Mol. Mass.:
526.4767
SMILES:
CC(C)OC(=O)[C@H](C)NP(=O)(OC[C@H]1O[C@@H](n2ccc(=O)[nH]c2=O)[C@](C)(N)[C@@H]1O)Oc1ccccc1
: