Target
Transitional endoplasmic reticulum ATPase
Ligand
BDBM163123
Substrate
Meas. Tech.
ADP Glo Assay
pH
7.5±n/a
Temperature
310.15±n/a K
IC50
<2000±n/a nM
Comments
extracted
Citation
 Zhou, HParlati, FWustrow, D Fused pyrimidines and substituted quinazolines as inhibitors of p97 US Patent  US9062026 Publication Date 6/23/2015 
Target
Name:
Transitional endoplasmic reticulum ATPase
Synonyms:
TERA_HUMAN VCP Valosin-containing protein
Type:
Enzyme
Mol. Mass.:
89300.63
Organism:
Homo sapiens (Human)
Description:
P55072
Residue:
806
  
Inhibitor
Name:
BDBM163123
Synonyms:
US9062026, Table III, Compound 51
Type:
Small organic molecule
Emp. Form.:
C24H20N4O
Mol. Mass.:
380.4418
SMILES:
COc1cccc2c(NCc3ccccc3)nc(nc12)-n1ccc2ccccc12
: