Target
Epidermal growth factor receptor
Ligand
BDBM5130
Substrate
EGF-R Tyrosine Kinase
Meas. Tech.
Autophosphorylation Assay
IC50
6.5±n/a nM
Citation
 Sun, LCui, JLiang, CZhou, YNematalla, AWang, XChen, HTang, CWei, J Rational design of 4,5-disubstituted-5,7-dihydro-pyrrolo[2,3-d]pyrimidin-6-ones as a novel class of inhibitors of epidermal growth factor receptor (EGF-R) and Her2(p185(erbB)) tyrosine kinases. Bioorg Med Chem Lett 12:2153-7 (2002)  
Target
Name:
Epidermal growth factor receptor
Synonyms:
EGF Receptor Substrate EGFR_HUMAN ERBB1 Epidermal Growth Factor Receptor erbB-1 Epidermal growth factor receptor (EGFR) HER1 Proto-oncogene c-ErbB-1 Tyrosine-Protein Kinase ErbB-1
Type:
Receptor Kinase Domain
Mol. Mass.:
134279.59
Organism:
Homo sapiens (Human)
Description:
P00533
Residue:
1210
  
Inhibitor
Name:
BDBM5130
Synonyms:
5-{[(5Z)-4-[(3-chloro-4-fluorophenyl)amino]-6-oxo-5H,6H,7H-pyrrolo[2,3-d]pyrimidin-5-ylidene]methyl}-4-methyl-N-[2-(morpholin-4-yl)ethyl]-1H-pyrrole-2-carboxamide | pyrrolo[2,3-d]pyrimidin-6-one deriv. 26h
Type:
Small organic molecule
Emp. Form.:
C25H25ClFN7O3
Mol. Mass.:
525.963
SMILES:
Cc1cc([nH]c1\C=C1/C(=O)Nc2ncnc(Nc3ccc(F)c(Cl)c3)c12)C(=O)NCCN1CCOCC1
:
Substrate
Name:
Epidermal growth factor receptor
Synonyms:
EGF Receptor Substrate EGFR_HUMAN ERBB1 Epidermal Growth Factor Receptor erbB-1 Epidermal growth factor receptor (EGFR) HER1 Proto-oncogene c-ErbB-1 Tyrosine-Protein Kinase ErbB-1
Type:
Receptor Kinase Domain
Mol. Mass.:
134279.59
Organism:
Homo sapiens (Human)
Description:
P00533
Residue:
1210