Target
Histone deacetylase 9
Ligand
BDBM163619
Substrate
Meas. Tech.
HDAC Fluorescent Assays
pH
8±n/a
IC50
>1.00e+5±n/a nM
Comments
extracted
Citation
 Wang, YStowe, RLPinello, CETian, GMadoux, FLi, DZhao, LYLi, JLWang, YWang, YMa, HHodder, PRoush, WRLiao, D Identification of histone deacetylase inhibitors with benzoylhydrazide scaffold that selectively inhibit class I histone deacetylases. Chem Biol 22:273-84 (2015)  
Target
Name:
Histone deacetylase 9
Synonyms:
HD9 HDAC7B HDAC9_HUMAN Histone acetylase 9 (HDAC9) Histone deacetylase 9 (HDAC9) Human HDAC9 MITR
Type:
Enzyme
Mol. Mass.:
111304.31
Organism:
Homo sapiens (Human)
Description:
Q9UKV0
Residue:
1011
  
Inhibitor
Name:
BDBM163619
Synonyms:
UF010 US11731934, Compound UF010
Type:
Small organic molecule
Emp. Form.:
C11H15BrN2O
Mol. Mass.:
271.154
SMILES:
CCCCNNC(=O)c1ccc(Br)cc1
: