Target
Histone deacetylase 3/Nuclear receptor corepressor 2 [395-498]
Ligand
BDBM163633
Substrate
Meas. Tech.
HDAC Activity Assays
IC50
6.98e+3±n/a nM
Citation
 Wang, YStowe, RLPinello, CETian, GMadoux, FLi, DZhao, LYLi, JLWang, YWang, YMa, HHodder, PRoush, WRLiao, D Identification of histone deacetylase inhibitors with benzoylhydrazide scaffold that selectively inhibit class I histone deacetylases. Chem Biol 22:273-84 (2015)  
Target
Name:
Histone deacetylase 3/Nuclear receptor corepressor 2 [395-498]
Synonyms:
HDAC3/NCOR2
Type:
Protein
Mol. Mass.:
Description:
BPS Bioscience
Components:
This complex has 2 components.
Component 1
Name:
Histone deacetylase 3
Synonyms:
HD3 HDAC3_HUMAN Human HDAC3 SMAP45
Type:
Enzyme
Mol. Mass.:
48829.55
Organism:
Homo sapiens (Human)
Description:
O15379
Residue:
428
  
Component 2
Name:
Nuclear receptor corepressor 2 [395-498]
Synonyms:
CTG26 NCOR2 Nuclear receptor corepressor 2
Type:
Protein
Mol. Mass.:
12719.17
Organism:
Homo sapiens (Human)
Description:
Deacetylase activation domain of human NCOR2 (395-498aa)
Residue:
104
  
Inhibitor
Name:
BDBM163633
Synonyms:
SR-3364 US11731934, Compound RLS2-256
Type:
Small organic molecule
Emp. Form.:
C13H17BrN2O
Mol. Mass.:
297.191
SMILES:
Brc1ccc(cc1)C(=O)NNCC1CCCC1
: