Target
Beta-glucuronidase
Ligand
BDBM163636
Substrate
Meas. Tech.
Inhibition Assays
Ki
1.6e+2± 1e+1 nM
Citation
 Wallace, BDRoberts, ABPollet, RMIngle, JDBiernat, KAPellock, SJVenkatesh, MKGuthrie, LO'Neal, SKRobinson, SJDollinger, MFigueroa, EMcShane, SRCohen, RDJin, JFrye, SVZamboni, WCPepe-Ranney, CMani, SKelly, LRedinbo, MR Structure and Inhibition of Microbiome ß-Glucuronidases Essential to the Alleviation of Cancer Drug Toxicity. Chem Biol 22:1238-49 (2015)  
Target
Name:
Beta-glucuronidase
Synonyms:
β-Glucuronidase Beta-glucuronidase (EcGUS) gusA | uidA
Type:
Protein
Mol. Mass.:
68431.57
Organism:
Escherichia coli (Enterobacteria)
Description:
P05804
Residue:
603
  
Inhibitor
Name:
BDBM163636
Synonyms:
3[(6,8Dimethyl2oxo1,2dihydroquinolin3 yl)methyl]1(4ethoxyphenyl)3(2hydroxyethyl)thiourea (Inh 1) | US9334288, 1
Type:
Small organic molecule
Emp. Form.:
C23H27N3O3S
Mol. Mass.:
425.544
SMILES:
CCOc1ccc(NC(=S)N(CCO)Cc2cc3cc(C)cc(C)c3[nH]c2=O)cc1
: