Target
Beta-glucuronidase
Ligand
BDBM163639
Substrate
Meas. Tech.
Inhibition Assays
Ki
1.4e+3± 2e+2 nM
Citation
 Wallace, BDRoberts, ABPollet, RMIngle, JDBiernat, KAPellock, SJVenkatesh, MKGuthrie, LO'Neal, SKRobinson, SJDollinger, MFigueroa, EMcShane, SRCohen, RDJin, JFrye, SVZamboni, WCPepe-Ranney, CMani, SKelly, LRedinbo, MR Structure and Inhibition of Microbiome ß-Glucuronidases Essential to the Alleviation of Cancer Drug Toxicity. Chem Biol 22:1238-49 (2015)  
Target
Name:
Beta-glucuronidase
Synonyms:
β-Glucuronidase Beta-glucuronidase (EcGUS) gusA | uidA
Type:
Protein
Mol. Mass.:
68431.57
Organism:
Escherichia coli (Enterobacteria)
Description:
P05804
Residue:
603
  
Inhibitor
Name:
BDBM163639
Synonyms:
Methyl 2({[(6ethyl2oxo1,2dihydroquinolin3yl)methyl](2 hydroxyethyl)carbamothioyl}amino)benzoate (Inh 4) | US9334288, 6
Type:
Small organic molecule
Emp. Form.:
C23H25N3O4S
Mol. Mass.:
439.527
SMILES:
CCc1ccc2[nH]c(=O)c(CN(CCO)C(=S)Nc3ccccc3C(=O)OC)cc2c1
: