Target
Pancreatic alpha-amylase
Ligand
BDBM163652
Substrate
Meas. Tech.
Kinetic Studies
Temperature
303.15±0 K
Ki
730±90 nM
Citation
 Williams, LKZhang, XCaner, STysoe, CNguyen, NTWicki, JWilliams, DEColeman, JMcNeill, JHYuen, VAndersen, RJWithers, SGBrayer, GD The amylase inhibitor montbretin A reveals a new glycosidase inhibition motif. Nat Chem Biol 11:691-6 (2015)  
Target
Name:
Pancreatic alpha-amylase
Synonyms:
1,4-alpha-D-glucan glucanohydrolase AMYP_HUMAN Pancreatic α-amylase (HPA) Pancreatic alpha-amylase (HPA)
Type:
Protein
Mol. Mass.:
57709.71
Organism:
Homo sapiens (Human)
Description:
Residue:
511
  
Inhibitor
Name:
BDBM163652
Synonyms:
MbA-C (6)
Type:
Small organic molecule
Emp. Form.:
C44H58O30
Mol. Mass.:
1066.9133
SMILES:
C[C@@H]1O[C@@H](O[C@@H]2CO[C@@H](Oc3c(O)cc(cc3O)-c3oc4cc(O)cc(O)c4c(=O)c3O[C@@H]3O[C@@H](C)[C@H](O)[C@@H](O)[C@H]3O[C@@H]3O[C@H](CO)[C@@H](O)[C@H](O)[C@H]3O[C@@H]3O[C@H](CO)[C@@H](O)[C@H](O)[C@H]3O)[C@H](O)[C@H]2O)[C@H](O)[C@H](O)[C@H]1O
: