Target
Probable UDP-galactopyranose mutase
Ligand
BDBM163667
Substrate
Meas. Tech.
HPLC-based Assay
Temperature
295.15±0 K
Kd
2.4e+4± 9e+3 nM
Citation
 Kincaid, VALondon, NWangkanont, KWesener, DAMarcus, SAHéroux, ANedyalkova, LTalaat, AMForest, KTShoichet, BKKiessling, LL Virtual Screening for UDP-Galactopyranose Mutase Ligands Identifies a New Class of Antimycobacterial Agents. ACS Chem Biol 10:2209-18 (2015)  
Target
Name:
Probable UDP-galactopyranose mutase
Synonyms:
GLF8_KLEPN Uridine 5'-diphosphate-galactopyranose mutase (UGM) | rfbD
Type:
Protein
Mol. Mass.:
44463.54
Organism:
Klebsiella pneumoniae (Enterobacteria)
Description:
Residue:
384
  
Inhibitor
Name:
BDBM163667
Synonyms:
2‐[6‐(4‐Chlorophenyl)‐3‐(2‐methoxyphenyl)‐7H‐[1,2,4]triazolo[3,4‐b][1,3,4]thiadiazin‐7‐yl]acetate (26)
Type:
Small organic molecule
Emp. Form.:
C19H14ClN4O3S
Mol. Mass.:
413.858
SMILES:
COc1ccccc1-c1nnc2SC(CC([O-])=O)C(=Nn12)c1ccc(Cl)cc1
: