Target
N-glycosylase/DNA lyase
Ligand
BDBM163679
Substrate
Meas. Tech.
Gel-based Cleavage Assay
IC50
2.2e+2± 8e+1 nM
Citation
 Donley, NJaruga, PCoskun, EDizdaroglu, MMcCullough, AKLloyd, RS Small Molecule Inhibitors of 8-Oxoguanine DNA Glycosylase-1 (OGG1). ACS Chem Biol 10:2334-43 (2015)  
Target
Name:
N-glycosylase/DNA lyase
Synonyms:
8-Oxoguanine DNA glycosylase-1 (OGG1) MUTM OGG1_HUMAN | OGH1
Type:
Protein
Mol. Mass.:
38794.33
Organism:
Homo sapiens (Human)
Description:
O15527
Residue:
345
  
Inhibitor
Name:
BDBM163679
Synonyms:
3,4‐Dichloro‐1‐benzothiophene‐2‐carbohydrazide (08)
Type:
Small organic molecule
Emp. Form.:
C9H6Cl2N2OS
Mol. Mass.:
261.128
SMILES:
NNC(=O)c1sc2cccc(Cl)c2c1Cl
: