Target
N-glycosylase/DNA lyase
Ligand
BDBM50106186
Substrate
Meas. Tech.
Fluorescence-based Assay
pH
7.5±n/a
Temperature
310.15±n/a K
IC50
>5.0e+4±n/a nM
Comments
extracted
Citation
 Donley, NJaruga, PCoskun, EDizdaroglu, MMcCullough, AKLloyd, RS Small Molecule Inhibitors of 8-Oxoguanine DNA Glycosylase-1 (OGG1). ACS Chem Biol 10:2334-43 (2015)  
Target
Name:
N-glycosylase/DNA lyase
Synonyms:
8-Oxoguanine DNA glycosylase-1 (OGG1) MUTM OGG1_HUMAN | OGH1
Type:
Protein
Mol. Mass.:
38794.33
Organism:
Homo sapiens (Human)
Description:
O15527
Residue:
345
  
Inhibitor
Name:
BDBM50106186
Synonyms:
4‐Bromobenzamide (0151-Am) CHEMBL339059
Type:
Small organic molecule
Emp. Form.:
C7H6BrNO
Mol. Mass.:
200.033
SMILES:
NC(=O)c1ccc(Br)cc1
: