Target
Lipopolysaccharide-induced tumor necrosis factor-alpha factor
Ligand
BDBM235293
Substrate
Meas. Tech.
TNF inhibition assay
IC50
680±n/a nM
Citation
 Mjalli, AMGaddam, BPolisetti, DRKostura, MJGuzel, M Tricyclic compounds as modulators of TNF-α synthesis and as PDE4 inhibitors US Patent  US10085990 Publication Date 10/2/2018 
Target
Name:
Lipopolysaccharide-induced tumor necrosis factor-alpha factor
Synonyms:
LITAF LPS-induced TNF-alpha factor SIMPLE TNF-alpha | p53-induced gene 7 protein
Type:
Enzyme Catalytic Domain
Mol. Mass.:
17106.57
Organism:
Homo sapiens (Human)
Description:
TNF-alpha 0 HUMAN::Q99732
Residue:
161
  
Inhibitor
Name:
BDBM235293
Synonyms:
US10085990, Example 16 | US9393245, 16
Type:
Small organic molecule
Emp. Form.:
C17H19N3O3
Mol. Mass.:
313.3511
SMILES:
CCCn1c2c3cccc(OC)c3ncc2c(=O)n(CC)c1=O
: