Target
Lipopolysaccharide-induced tumor necrosis factor-alpha factor
Ligand
BDBM235388
Substrate
Meas. Tech.
TNF inhibition assay
IC50
50000±n/a nM
Citation
 Mjalli, AMGaddam, BPolisetti, DRKostura, MJGuzel, M Tricyclic compounds as modulators of TNF-α synthesis and as PDE4 inhibitors US Patent  US10085990 Publication Date 10/2/2018 
Target
Name:
Lipopolysaccharide-induced tumor necrosis factor-alpha factor
Synonyms:
LITAF LPS-induced TNF-alpha factor SIMPLE TNF-alpha | p53-induced gene 7 protein
Type:
Enzyme Catalytic Domain
Mol. Mass.:
17106.57
Organism:
Homo sapiens (Human)
Description:
TNF-alpha 0 HUMAN::Q99732
Residue:
161
  
Inhibitor
Name:
BDBM235388
Synonyms:
US10085990, Example 124 | US9393245, 124
Type:
Small organic molecule
Emp. Form.:
C25H23ClN4O5
Mol. Mass.:
494.927
SMILES:
COC(=O)N1CCC(CC1)n1c2c3cccc(OC)c3ncc2c(=O)n(-c2cccc(Cl)c2)c1=O
: