Target
cAMP-specific 3',5'-cyclic phosphodiesterase 4D
Ligand
BDBM135818
Substrate
Meas. Tech.
PDE4 Inhibition Assay
Temperature
298.15±n/a K
IC50
151±n/a nM
Comments
extracted
Citation
 Mjalli, AMGaddam, BPolisetti, DRKostura, MJGuzel, M Tricyclic compounds as modulators of TNF-α synthesis and as PDE4 inhibitors US Patent  US10085990 Publication Date 10/2/2018 
Target
Name:
cAMP-specific 3',5'-cyclic phosphodiesterase 4D
Synonyms:
3',5'-cyclic phosphodiesterase PDE43 PDE4D_HUMAN | Phosphodiesterase 4D
Type:
Protein
Mol. Mass.:
91092.69
Organism:
Homo sapiens (Human)
Description:
Q08499
Residue:
809
  
Inhibitor
Name:
BDBM135818
Synonyms:
US10085990, Example 92 US8853226, 92 US9833457, 92
Type:
Small organic molecule
Emp. Form.:
C24H23ClN4O5S
Mol. Mass.:
514.981
SMILES:
COc1cccc2c1ncc1c2n(C2CCN(CC2)S(C)(=O)=O)c(=O)n(-c2cccc(Cl)c2)c1=O
: