Target
ATP-sensitive inward rectifier potassium channel 1
Ligand
BDBM163750
Substrate
Meas. Tech.
Electrophysiology Assay
pH
7.4±n/a
IC50
100±n/a nM
Comments
extracted
Citation
 Pasternak, ABlizzard, TChobanian, Hde Jesus, RDing, FDong, SGude, CKim, DTang, HWalsh, SPio, BJiang, J Inhibitors of the renal outer medullary potassium channel US Patent  US9062070 Publication Date 6/23/2015 
Target
Name:
ATP-sensitive inward rectifier potassium channel 1
Synonyms:
ATP-regulated potassium channel ROM-K Inward rectifier K(+) channel Kir1.1 KCNJ1_RAT Potassium channel (ATP modulatory) Renal Outer Medullary Potassium (ROMK) Romk1 | The Renal Outer Medullary Potassium (ROMK) channel (Kir1.1)
Type:
Enzyme
Mol. Mass.:
44976.27
Organism:
Rattus norvegicus (Rat)
Description:
P35560
Residue:
391
  
Inhibitor
Name:
BDBM163750
Synonyms:
US9062070, 6 | US9062070, 7
Type:
Small organic molecule
Emp. Form.:
C25H25FN8O2
Mol. Mass.:
488.5168
SMILES:
Cc1c(ccc(F)c1[N+]#[C-])[C@@H]1CN2CCN(C[C@H]2CO1)C(=O)C1CCc2nc(ccc12)-n1cnnn1
: