Target
Isocitrate dehydrogenase [NADP] cytoplasmic [R132H]
Ligand
BDBM287849
Substrate
Meas. Tech.
R132H IDH1 Enzymatic Assay
pH
7±n/a
Temperature
298.15±n/a K
IC50
12.0±n/a nM
Comments
extracted
Citation
 Fischer, CBogen, SLChilders, MLFradera Llinas, FXKim, AJLampe, JWMachacek, MRMcMasters, DRParker, Jr., DLSciammetta, NShao, PPSloman, DLSun, WUjjainwalla, FHuang, C Tricyclic compounds as inhibitors of mutant IDH enzymes US Patent  US10086000 Publication Date 10/2/2018 
Target
Name:
Isocitrate dehydrogenase [NADP] cytoplasmic [R132H]
Synonyms:
Cytosolic NADP-isocitrate dehydrogenase (IDH1)(R132H) IDH1 R132H IDHC_HUMAN Isocitrate dehydrogenase 1 mutant (R132H) Isocitrate dehydrogenase [NADP] cytoplasmic (IDH1)(R132H) PICD
Type:
Protein
Mol. Mass.:
46641.74
Organism:
Homo sapiens (Human)
Description:
Human IDH1 R132H (SEQ ID No. 2 in patent). First three are removed. Google patent parsed wrong.
Residue:
414
  
Inhibitor
Name:
BDBM287849
Synonyms:
6-(6,7,8,9-tetrahydro-5H- benzo[7]annulen-7- ylcarbonyl)-6,11-dihydro- 5H-pyrido[2,3-b] [1,5]benzodiazepin-7-ol US10508108, Example 66
Type:
Small organic molecule
Emp. Form.:
C24H23N3O2
Mol. Mass.:
385.4583
SMILES:
Oc1cccc2Nc3ncccc3CN(C(=O)C3CCc4ccccc4CC3)c12
: