Target
Isocitrate dehydrogenase [NADP] cytoplasmic [R132H]
Ligand
BDBM287853
Substrate
Meas. Tech.
R132H IDH1 Enzymatic Assay
pH
7±n/a
Temperature
298.15±n/a K
IC50
77.0±n/a nM
Comments
extracted
Citation
 Fischer, CBogen, SLChilders, MLFradera Llinas, FXKim, AJLampe, JWMachacek, MRMcMasters, DRParker, Jr., DLSciammetta, NShao, PPSloman, DLSun, WUjjainwalla, FHuang, C Tricyclic compounds as inhibitors of mutant IDH enzymes US Patent  US10086000 Publication Date 10/2/2018 
Target
Name:
Isocitrate dehydrogenase [NADP] cytoplasmic [R132H]
Synonyms:
Cytosolic NADP-isocitrate dehydrogenase (IDH1)(R132H) IDH1 R132H IDHC_HUMAN Isocitrate dehydrogenase 1 mutant (R132H) Isocitrate dehydrogenase [NADP] cytoplasmic (IDH1)(R132H) PICD
Type:
Protein
Mol. Mass.:
46641.74
Organism:
Homo sapiens (Human)
Description:
Human IDH1 R132H (SEQ ID No. 2 in patent). First three are removed. Google patent parsed wrong.
Residue:
414
  
Inhibitor
Name:
BDBM287853
Synonyms:
6-[(3- methyloctahydropentalen- 1-yl)carbonyl]-8- morpholin-4-yl-6,11- dihydro-5H-pyrido[2,3- b][1,5]benzodiazepine US10508108, Example 70
Type:
Small organic molecule
Emp. Form.:
C26H32N4O2
Mol. Mass.:
432.5579
SMILES:
CC1CC(C2CCCC12)C(=O)N1Cc2cccnc2Nc2ccc(cc12)N1CCOCC1
: