Target
Isocitrate dehydrogenase [NADP] cytoplasmic [R132H]
Ligand
BDBM287888
Substrate
Meas. Tech.
R132H IDH1 Enzymatic Assay
pH
7±n/a
Temperature
298.15±n/a K
IC50
36.0±n/a nM
Comments
extracted
Citation
 Fischer, CBogen, SLChilders, MLFradera Llinas, FXKim, AJLampe, JWMachacek, MRMcMasters, DRParker, Jr., DLSciammetta, NShao, PPSloman, DLSun, WUjjainwalla, FHuang, C Tricyclic compounds as inhibitors of mutant IDH enzymes US Patent  US10086000 Publication Date 10/2/2018 
Target
Name:
Isocitrate dehydrogenase [NADP] cytoplasmic [R132H]
Synonyms:
Cytosolic NADP-isocitrate dehydrogenase (IDH1)(R132H) IDH1 R132H IDHC_HUMAN Isocitrate dehydrogenase 1 mutant (R132H) Isocitrate dehydrogenase [NADP] cytoplasmic (IDH1)(R132H) PICD
Type:
Protein
Mol. Mass.:
46641.74
Organism:
Homo sapiens (Human)
Description:
Human IDH1 R132H (SEQ ID No. 2 in patent). First three are removed. Google patent parsed wrong.
Residue:
414
  
Inhibitor
Name:
BDBM287888
Synonyms:
(R)-(2,3-Dihydrobenzo[b][1,4]dioxin-2-yl)(8-(tetrahydro-2H-pyran-4-yl)-5,11-dihydro-6H-benzo[b]pyrido[2,3-e][1,4]diazepin-6-yl)methanone US10508108, Example 105
Type:
Small organic molecule
Emp. Form.:
C26H25N3O4
Mol. Mass.:
443.4944
SMILES:
O=C([C@H]1COc2ccccc2O1)N1Cc2cccnc2Nc2ccc(cc12)C1CCOCC1
: