Target
BDNF/NT-3 growth factors receptor
Ligand
BDBM164956
Substrate
Meas. Tech.
Inhibition Assay
pH
7.5±n/a
Temperature
298.15±n/a K
IC50
0.6±n/a nM
Comments
extracted
Citation
 Kane, Jr., JLMatthews, GMetz, MKothe, MLiu, JScholte, A Tropomyosin-related kinase (TRK) inhibitors US Patent  US9067914 Publication Date 6/30/2015 
Target
Name:
BDNF/NT-3 growth factors receptor
Synonyms:
GP145-TrkB NTRK2 Neurotrophic tyrosine kinase receptor type 2 Trk-B Tropomyosin-related kinase B Tyrosine kinase receptor B (Trk-B)
Type:
Enzyme
Mol. Mass.:
91996.87
Organism:
Homo sapiens (Human)
Description:
Q16620
Residue:
822
  
Inhibitor
Name:
BDBM164956
Synonyms:
US10166239, Ex. 3-49-6a US9067914, Ex. 3-49-6a
Type:
Small organic molecule
Emp. Form.:
C27H25F3N6O2
Mol. Mass.:
522.5216
SMILES:
COc1cc(ccc1OCc1ccc(cc1)C(F)(F)F)[C@H](C)n1c(N)nc2cc(cnc12)-c1cnn(C)c1
: