Target
Transient receptor potential M8 protein
Ligand
BDBM166022
Substrate
Meas. Tech.
FLIPR Assay
Temperature
298.15±n/a K
IC50
4.04±n/a nM
Comments
extracted
Citation
 Macielag, MJXia, MMcNally, JJMatthews, JM Imidazo[1,2-α]pyridine sulfonamides as TRPM8 modulators US Patent  US9067935 Publication Date 6/30/2015 
Target
Name:
Transient receptor potential M8 protein
Synonyms:
Cold-menthol receptor (TRPM8) Transient receptor potential M8 protein Transient receptor potential melastatin subfamily, type 8 (TRPM8)
Type:
Enzyme
Mol. Mass.:
127589.43
Organism:
Canis lupus familiaris (Dog)
Description:
Q1A7N1
Residue:
1104
  
Inhibitor
Name:
BDBM166022
Synonyms:
US9067935, 98
Type:
Small organic molecule
Emp. Form.:
C24H17ClF3N5O2S
Mol. Mass.:
531.937
SMILES:
FC(F)(F)c1ccc(CN(c2nc3ccccn3c2Cl)S(=O)(=O)c2ccc(cc2)-n2cccn2)cc1
: