Target
Maternal embryonic leucine zipper kinase
Ligand
BDBM166108
Substrate
Meas. Tech.
Kinase Assay
pH
7.4±n/a
Temperature
298.15±n/a K
IC50
27±n/a nM
Comments
extracted
Citation
 Matsuo, YHisada, SNakamura, YAhmed, FWalker, JRHuntley, R 1,5-naphthyridine derivatives and MELK inhibitors containing the same US Patent  US9067937 Publication Date 6/30/2015 
Target
Name:
Maternal embryonic leucine zipper kinase
Synonyms:
KIAA0175 MELK_HUMAN Maternal embryonic leucine zipper kinase (MELK)
Type:
Enzyme
Mol. Mass.:
74665.45
Organism:
Homo sapiens (Human)
Description:
Q14680
Residue:
651
  
Inhibitor
Name:
BDBM166108
Synonyms:
US9067937, 52
Type:
Small organic molecule
Emp. Form.:
C27H26ClFN6O2
Mol. Mass.:
520.986
SMILES:
CN(C)C1CCN(C1)c1ccc(Nc2c(cnc3ccc(nc23)-c2cc(F)c(O)c(Cl)c2)C(C)=O)cn1
: