Target
Maternal embryonic leucine zipper kinase
Ligand
BDBM166153
Substrate
Meas. Tech.
Kinase Assay
pH
7.4±n/a
Temperature
298.15±n/a K
IC50
0.93±n/a nM
Comments
extracted
Citation
 Matsuo, YHisada, SNakamura, YAhmed, FWalker, JRHuntley, R 1,5-naphthyridine derivatives and MELK inhibitors containing the same US Patent  US9067937 Publication Date 6/30/2015 
Target
Name:
Maternal embryonic leucine zipper kinase
Synonyms:
KIAA0175 MELK_HUMAN Maternal embryonic leucine zipper kinase (MELK)
Type:
Enzyme
Mol. Mass.:
74665.45
Organism:
Homo sapiens (Human)
Description:
Q14680
Residue:
651
  
Inhibitor
Name:
BDBM166153
Synonyms:
US9067937, 201
Type:
Small organic molecule
Emp. Form.:
C28H26Cl2N6O2
Mol. Mass.:
549.451
SMILES:
N[C@@H]1CCCN(C1)c1ccc(Nc2c(cnc3ccc(nc23)-c2cc(Cl)c(O)c(Cl)c2)C(=O)C2CC2)cn1
: