Target
Maternal embryonic leucine zipper kinase
Ligand
BDBM166157
Substrate
Meas. Tech.
Kinase Assay
pH
7.4±n/a
Temperature
298.15±n/a K
IC50
2.8±n/a nM
Comments
extracted
Citation
 Matsuo, YHisada, SNakamura, YAhmed, FWalker, JRHuntley, R 1,5-naphthyridine derivatives and MELK inhibitors containing the same US Patent  US9067937 Publication Date 6/30/2015 
Target
Name:
Maternal embryonic leucine zipper kinase
Synonyms:
KIAA0175 MELK_HUMAN Maternal embryonic leucine zipper kinase (MELK)
Type:
Enzyme
Mol. Mass.:
74665.45
Organism:
Homo sapiens (Human)
Description:
Q14680
Residue:
651
  
Inhibitor
Name:
BDBM166157
Synonyms:
US9067937, 205
Type:
Small organic molecule
Emp. Form.:
C26H30ClFN4O2
Mol. Mass.:
484.993
SMILES:
CCC(=O)c1cnc2ccc(nc2c1N[C@H]1CC[C@H](CN(C)C)CC1)-c1cc(F)c(O)c(Cl)c1
: