Target
Sodium channel protein type 10 subunit alpha
Ligand
BDBM161324
Substrate
Meas. Tech.
E-VIPR Optical Membrane Potential Assay
IC50
19.0±n/a nM
Citation
 Hadida-Ruah, SSAnderson, CArumugam, VAsgian, ILBear, BRTermin, APJohnson, JP Pyridone amides as modulators of sodium channels US Patent  US10087143 Publication Date 10/2/2018 
Target
Name:
Sodium channel protein type 10 subunit alpha
Synonyms:
PN3 SCN10A Sodium channel alpha subunit Sodium channel protein type X alpha subunit fret-membrane potential nav1.8 | hPN3
Type:
Enzyme
Mol. Mass.:
220609.21
Organism:
Homo sapiens (Human)
Description:
Q9Y5Y9
Residue:
1956
  
Inhibitor
Name:
BDBM161324
Synonyms:
US10087143, Compound 109 US11673864, Compound 109 US9758483, Compound 109
Type:
Small organic molecule
Emp. Form.:
C18H10Cl2F2N2O3
Mol. Mass.:
411.186
SMILES:
Fc1ccc(Oc2cc(Cl)c(F)cc2C(=O)Nc2cc[nH]c(=O)c2)c(Cl)c1
: