Target
Sodium channel protein type 10 subunit alpha
Ligand
BDBM161373
Substrate
Meas. Tech.
E-VIPR Optical Membrane Potential Assay
IC50
2.00±n/a nM
Citation
 Hadida-Ruah, SSAnderson, CArumugam, VAsgian, ILBear, BRTermin, APJohnson, JP Pyridone amides as modulators of sodium channels US Patent  US10087143 Publication Date 10/2/2018 
Target
Name:
Sodium channel protein type 10 subunit alpha
Synonyms:
PN3 SCN10A Sodium channel alpha subunit Sodium channel protein type X alpha subunit fret-membrane potential nav1.8 | hPN3
Type:
Enzyme
Mol. Mass.:
220609.21
Organism:
Homo sapiens (Human)
Description:
Q9Y5Y9
Residue:
1956
  
Inhibitor
Name:
BDBM161373
Synonyms:
US10087143, Compound 158 US11673864, Compound 158 US9758483, Compound 158
Type:
Small organic molecule
Emp. Form.:
C20H14F4N2O4
Mol. Mass.:
422.3298
SMILES:
COc1cc(F)ccc1Oc1cc(ccc1C(=O)Nc1cc[nH]c(=O)c1)C(F)(F)F
: