Target
Amine oxidase [flavin-containing] B
Ligand
BDBM166633
Substrate
Meas. Tech.
MAO Inhibition Assay
IC50
1.3± 0.06 nM
Citation
 Legoabe, LJPetzer, APetzer, JP The Synthesis and Evaluation of C7-Substituted a-Tetralone Derivatives as Inhibitors of Monoamine Oxidase. Chem Biol Drug Des 86:895-904 (2015)  
Target
Name:
Amine oxidase [flavin-containing] B
Synonyms:
AOFB_HUMAN MAOB Monoamine oxidase type B (MAO B) Monoamine oxidase type B (MAOB)
Type:
Protein
Mol. Mass.:
58768.76
Organism:
Homo sapiens (Human)
Description:
P27338
Residue:
520
  
Inhibitor
Name:
BDBM166633
Synonyms:
7-[(3-Fluorobenzyl)oxy]-3,4-dihydronaphthalen-1(2H)-one (4d)
Type:
Small organic molecule
Emp. Form.:
C17H15FO2
Mol. Mass.:
270.2982
SMILES:
Fc1cccc(COc2ccc3CCCC(=O)c3c2)c1
: