Target
DNA gyrase subunit B
Ligand
BDBM166655
Substrate
Meas. Tech.
GyraseB Assay
pH
7.5±n/a
IC50
1.033e+4± 5.1e+2 nM
Comments
extracted
Citation
 Janupally, RMedepi, BBrindha Devi, PSuryadevara, PJeankumar, VUKulkarni, PYogeeswari, PSriram, D Design and Biological Evaluation of Furan/Pyrrole/Thiophene-2-carboxamide Derivatives as Efficient DNA GyraseB Inhibitors of Staphylococcus aureus. Chem Biol Drug Des 86:918-25 (2015)  
Target
Name:
DNA gyrase subunit B
Synonyms:
DNA gyrase DNA gyrase subunit B (gyrB) gyrB
Type:
Enzyme Subunit
Mol. Mass.:
72530.91
Organism:
Staphylococcus aureus
Description:
Residue:
644
  
Inhibitor
Name:
BDBM166655
Synonyms:
4-(4-(5-methylfuran-2-carboxamido)phenylamino)-4-oxobutanoate (14)
Type:
Small organic molecule
Emp. Form.:
C16H15N2O5
Mol. Mass.:
315.3012
SMILES:
Cc1ccc(o1)C(=O)Nc1ccc(NC(=O)CCC([O-])=O)cc1
: