Target
DNA gyrase subunit B
Ligand
BDBM166657
Substrate
Meas. Tech.
Supercoiling Assay
pH
7.6±n/a
Temperature
298.15±n/a K
IC50
1.25e+4± 5.1e+2 nM
Comments
extracted
Citation
 Janupally, RMedepi, BBrindha Devi, PSuryadevara, PJeankumar, VUKulkarni, PYogeeswari, PSriram, D Design and Biological Evaluation of Furan/Pyrrole/Thiophene-2-carboxamide Derivatives as Efficient DNA GyraseB Inhibitors of Staphylococcus aureus. Chem Biol Drug Des 86:918-25 (2015)  
Target
Name:
DNA gyrase subunit B
Synonyms:
DNA gyrase DNA gyrase subunit B (gyrB) gyrB
Type:
Enzyme Subunit
Mol. Mass.:
72530.91
Organism:
Staphylococcus aureus
Description:
Residue:
644
  
Inhibitor
Name:
BDBM166657
Synonyms:
4-oxo-4-((4-(thiophene-2-carboxamido)phenyl)amino)butanoate (16)
Type:
Small organic molecule
Emp. Form.:
C15H13N2O4S
Mol. Mass.:
317.34
SMILES:
[O-]C(=O)CCC(=O)Nc1ccc(NC(=O)c2cccs2)cc1
: