Target
Arachidonate 5-lipoxygenase-activating protein
Ligand
BDBM167137
Substrate
Meas. Tech.
Homogeneous Time Resolved Fluorescence Assay
Ki
>10000±n/a nM
Citation
 Eccles, WFitzgerald, AEHack, MDHawryluk, NAJones, WMKeith, JMKrawczuk, PLebsack, ADLiu, JMani, NSMcClure, KJMeduna, SPRosen, MD Flap modulators US Patent  US9073876 Publication Date 7/7/2015 
Target
Name:
Arachidonate 5-lipoxygenase-activating protein
Synonyms:
5-lipoxygenase activating protein 5-lipoxygenase/FLAP ALOX5AP MK-886-binding protein
Type:
Enzyme
Mol. Mass.:
18159.90
Organism:
Homo sapiens (Human)
Description:
P20292
Residue:
161
  
Inhibitor
Name:
BDBM167137
Synonyms:
US9073876, 219 | US9732093, Compound 219
Type:
Small organic molecule
Emp. Form.:
C15H16FN3O
Mol. Mass.:
273.3054
SMILES:
COc1c(F)c(ccc1C1CCC1)-c1ccc(N)nn1
: