Target
Arachidonate 5-lipoxygenase-activating protein
Ligand
BDBM167188
Substrate
Meas. Tech.
Homogeneous Time Resolved Fluorescence Assay
Ki
0.9±n/a nM
Citation
 Eccles, WFitzgerald, AEHack, MDHawryluk, NAJones, WMKeith, JMKrawczuk, PLebsack, ADLiu, JMani, NSMcClure, KJMeduna, SPRosen, MD Flap modulators US Patent  US9073876 Publication Date 7/7/2015 
Target
Name:
Arachidonate 5-lipoxygenase-activating protein
Synonyms:
5-lipoxygenase activating protein 5-lipoxygenase/FLAP ALOX5AP MK-886-binding protein
Type:
Enzyme
Mol. Mass.:
18159.90
Organism:
Homo sapiens (Human)
Description:
P20292
Residue:
161
  
Inhibitor
Name:
BDBM167188
Synonyms:
US9073876, 269 | US9732093, Compound 269
Type:
Small organic molecule
Emp. Form.:
C20H21FN6O
Mol. Mass.:
380.4187
SMILES:
CNc1nc(C)cc(Oc2c(F)c(ccc2C2CCC2)-c2cnc(N)cn2)n1
: