Target
Eukaryotic translation initiation factor 4E
Ligand
BDBM167375
Substrate
Meas. Tech.
Binding Assay
pH
7±n/a
IC50
1600±n/a nM
Comments
extracted
Citation
 Gillespie, P Benzoic acid derivatives US Patent  US9073881 Publication Date 7/7/2015 
Target
Name:
Eukaryotic translation initiation factor 4E
Synonyms:
EIF4E EIF4F Eukaryotic translation initiation factor 4E (eIF4E) IF4E_HUMAN
Type:
Protein
Mol. Mass.:
25095.44
Organism:
Homo sapiens (Human)
Description:
P06730
Residue:
217
  
Inhibitor
Name:
BDBM167375
Synonyms:
US9073881, 127
Type:
Small organic molecule
Emp. Form.:
C23H11Cl3F3NO2S
Mol. Mass.:
528.758
SMILES:
OC(=O)c1cc(ccc1-c1ccc(cc1Cl)C(F)(F)F)-c1nc(cs1)-c1ccc(Cl)c(Cl)c1
: